BDBM70072 1-(4-amino-1,2,5-oxadiazol-3-yl)-N-[1-(3-bromophenyl)ethylideneamino]-5-[(4-methyl-1-piperidinyl)methyl]-4-triazolecarboxamide::1-(4-amino-1,2,5-oxadiazol-3-yl)-N-[1-(3-bromophenyl)ethylideneamino]-5-[(4-methylpiperidin-1-yl)methyl]triazole-4-carboxamide::1-(4-aminofurazan-3-yl)-N-[1-(3-bromophenyl)ethylideneamino]-5-[(4-methylpiperidino)methyl]triazole-4-carboxamide::1-(4-azanyl-1,2,5-oxadiazol-3-yl)-N-[1-(3-bromophenyl)ethylideneamino]-5-[(4-methylpiperidin-1-yl)methyl]-1,2,3-triazole-4-carboxamide::MLS001075097::SMR000646483::cid_3395251
SMILES CC1CCN(Cc2c(nnn2-c2nonc2N)C(=O)NN=C(C)c2cccc(Br)c2)CC1
InChI Key InChIKey=ZTZSRUNFBHZABL-UHFFFAOYSA-N
Data  1 EC50
  Tab Delimited (TSV)   2D SDfile   Computed 3D by Vconf -m prep SDfile
Find this compound or compounds like it in BindingDB:
Activity Spreadsheet -- Enzyme Inhibition Constant Data from BindingDB
Found 1 hit for monomerid = 70072
TargetGlycogen synthase kinase-3 beta(Homo sapiens (Human))
Broad Institute
Curated by PubChem BioAssay
LigandPNGBDBM70072(1-(4-amino-1,2,5-oxadiazol-3-yl)-N-[1-(3-bromophen...)
Affinity DataEC50:  2.54E+4nM. Assay description: Keywords: GSK3beta, dose response, kinase, inhibition, HTS Assay Overview: The glycogen synthase kinase-3 beta (GSK-3b) is a known master regulator f...
In DepthDetails PCBioAssay